Target
Growth hormone secretagogue receptor type 1
Ligand
BDBM50181203
Substrate
Meas. Tech.
ChEMBL_345663 (CHEMBL859713)
IC50
34±n/a nM
Citation
 Liu, BLiu, MXin, ZZhao, HSerby, MDKosogof, CNelson, LTSzczepankiewicz, BGKaszubska, WSchaefer, VGFalls, HDLin, CWCollins, CASham, HLLiu, G Optimization of 2,4-diaminopyrimidines as GHS-R antagonists: side chain exploration. Bioorg Med Chem Lett 16:1864-8 (2006)  
Target
Name:
Growth hormone secretagogue receptor type 1
Synonyms:
GH-releasing peptide receptor GHS-R GHSR_HUMAN Ghrelin receptor | Ghrelin receptor 1a (GHS-R1a)
Type:
Receptor
Mol. Mass.:
41334.57
Organism:
Homo sapiens (Human)
Description:
Receptor binding studies use plasma membranes from LLC PK-1 cells transiently transfected with hGHSR1a.
Residue:
366
  
Inhibitor
Name:
BDBM50181203
Synonyms:
5-(4-(4-(methylsulfonyl)benzylamino)phenyl)-6-(isoindolin-2-ylmethyl)pyrimidine-2,4-diamine | CHEMBL381759
Type:
Small organic molecule
Emp. Form.:
C27H28N6O2S
Mol. Mass.:
500.615
SMILES:
CS(=O)(=O)c1ccc(CNc2ccc(cc2)-c2c(N)nc(N)nc2CN2Cc3ccccc3C2)cc1
: