Target
RNA-directed RNA polymerase
Ligand
BDBM50181666
Substrate
Meas. Tech.
ChEMBL_330651 (CHEMBL867029)
IC50
41±n/a nM
Citation
 Tedesco, RShaw, ANBambal, RChai, DConcha, NODarcy, MGDhanak, DFitch, DMGates, AGerhardt, WGHalegoua, DLHan, CHofmann, GAJohnston, VKKaura, ACLiu, NKeenan, RMLin-Goerke, JSarisky, RTWiggall, KJZimmerman, MNDuffy, KJ 3-(1,1-dioxo-2H-(1,2,4)-benzothiadiazin-3-yl)-4-hydroxy-2(1H)-quinolinones, potent inhibitors of hepatitis C virus RNA-dependent RNA polymerase. J Med Chem 49:971-83 (2006)  
Target
Name:
RNA-directed RNA polymerase
Synonyms:
Hepatitis C virus NS5B RNA-dependent RNA polymerase | NS5B protein
Type:
Protein
Mol. Mass.:
25173.95
Organism:
Hepatitis C virus
Description:
Q8JXU8
Residue:
229
  
Inhibitor
Name:
BDBM50181666
Synonyms:
3-(1,1-dioxo-1,4-dihydro-1-benzo[1,2,4]thiadiazin-3-yl)-4-hydroxy-1-(2-methylcyclopropylmethyl)-1H-quinolin-2-one | CHEMBL203254
Type:
Small organic molecule
Emp. Form.:
C21H19N3O4S
Mol. Mass.:
409.458
SMILES:
CC1CC1Cn1c2ccccc2c(O)c(C2=Nc3ccccc3S(=O)(=O)N2)c1=O
: