Target
ALK tyrosine kinase receptor/Nucleophosmin
Ligand
BDBM50181670
Substrate
Meas. Tech.
ChEMBL_331457 (CHEMBL865898)
IC50
3600±n/a nM
Citation
 Li, RXue, LZhu, TJiang, QCui, XYan, ZMcGee, DWang, JGantla, VRPickens, JCMcGrath, DChucholowski, AMorris, SWWebb, TR Design and synthesis of 5-aryl-pyridone-carboxamides as inhibitors of anaplastic lymphoma kinase. J Med Chem 49:1006-15 (2006)  
Target
Name:
ALK tyrosine kinase receptor/Nucleophosmin
Synonyms:
NPM/ALK (Nucleophosmin/ALK tyrosine kinase receptor)
Type:
Mol. Mass.:
Description:
ASSAY_ID of EBI is 331455
Components:
This complex has 2 components.
Component 1
Name:
ALK tyrosine kinase receptor
Synonyms:
ALK ALK_HUMAN CD_antigen: CD246
Type:
Protein
Mol. Mass.:
176453.10
Organism:
Homo sapiens (Human)
Description:
Q9UM73
Residue:
1620
  
Component 2
Name:
Nucleophosmin
Synonyms:
NPM NPM1 | NPM_HUMAN
Type:
PROTEIN
Mol. Mass.:
32552.99
Organism:
Homo sapiens (Human)
Description:
ChEMBL_1502715
Residue:
294
  
Component 3
Name:
ALK tyrosine kinase receptor
Synonyms:
ALK ALK_HUMAN CD_antigen: CD246
Type:
Protein
Mol. Mass.:
176453.10
Organism:
Homo sapiens (Human)
Description:
Q9UM73
Residue:
1620
  
Inhibitor
Name:
BDBM50181670
Synonyms:
5-benzo[1,3]dioxol-5-yl-2-oxo-1,2-dihydro-pyridine-3-carboxylic acid [4-(4-methyl-piperazin-1-yl)-phenyl]-amide | CHEMBL436509
Type:
Small organic molecule
Emp. Form.:
C24H24N4O4
Mol. Mass.:
432.4718
SMILES:
CN1CCN(CC1)c1ccc(NC(=O)c2cc(c[nH]c2=O)-c2ccc3OCOc3c2)cc1
: