Target
RNA-directed RNA polymerase
Ligand
BDBM50181727
Substrate
Meas. Tech.
ChEMBL_331786 (CHEMBL864669)
IC50
7000±n/a nM
Citation
 Powers, JPPiper, DELi, YMayorga, VAnzola, JChen, JMJaen, JCLee, GLiu, JPeterson, MGTonn, GRYe, QWalker, NPWang, Z SAR and mode of action of novel non-nucleoside inhibitors of hepatitis C NS5b RNA polymerase. J Med Chem 49:1034-46 (2006)  
Target
Name:
RNA-directed RNA polymerase
Synonyms:
Hepatitis C virus NS5B RNA-dependent RNA polymerase | NS5B protein
Type:
Protein
Mol. Mass.:
25173.95
Organism:
Hepatitis C virus
Description:
Q8JXU8
Residue:
229
  
Inhibitor
Name:
BDBM50181727
Synonyms:
5-(4-fluorobenzylidene)-3-amino-4-oxo-2-thionothiazolidine | CHEMBL373014
Type:
Small organic molecule
Emp. Form.:
C10H7FN2OS2
Mol. Mass.:
254.304
SMILES:
NN1C(=S)S\C(=C/c2ccc(F)cc2)C1=O
: