Target
RNA-directed RNA polymerase
Ligand
BDBM50181735
Substrate
Meas. Tech.
ChEMBL_331786 (CHEMBL864669)
IC50
100±n/a nM
Citation
 Powers, JPPiper, DELi, YMayorga, VAnzola, JChen, JMJaen, JCLee, GLiu, JPeterson, MGTonn, GRYe, QWalker, NPWang, Z SAR and mode of action of novel non-nucleoside inhibitors of hepatitis C NS5b RNA polymerase. J Med Chem 49:1034-46 (2006)  
Target
Name:
RNA-directed RNA polymerase
Synonyms:
Hepatitis C virus NS5B RNA-dependent RNA polymerase | NS5B protein
Type:
Protein
Mol. Mass.:
25173.95
Organism:
Hepatitis C virus
Description:
Q8JXU8
Residue:
229
  
Inhibitor
Name:
BDBM50181735
Synonyms:
5-(5-[2-chloro-5-(trifluoromethyl)phenyl]-furan-2-methylene)-3-(benzenesulfonylamino)-4-oxo-2-thionothiazolidine | CHEMBL381101
Type:
Small organic molecule
Emp. Form.:
C21H12ClF3N2O4S3
Mol. Mass.:
544.974
SMILES:
FC(F)(F)c1ccc(Cl)c(c1)-c1ccc(C=C2SC(=S)N(NS(=O)(=O)c3ccccc3)C2=O)o1
: