Target
Metabotropic glutamate receptor 5
Ligand
BDBM50181768
Substrate
Meas. Tech.
ChEMBL_331630 (CHEMBL864050)
IC50
475±n/a nM
Citation
 Iso, YGrajkowska, EWroblewski, JTDavis, JGoeders, NEJohnson, KMSanker, SRoth, BLTueckmantel, WKozikowski, AP Synthesis and structure-activity relationships of 3-[(2-methyl-1,3-thiazol-4-yl)ethynyl]pyridine analogues as potent, noncompetitive metabotropic glutamate receptor subtype 5 antagonists; search for cocaine medications. J Med Chem 49:1080-100 (2006)  
Target
Name:
Metabotropic glutamate receptor 5
Synonyms:
GPRC1E GRM5_HUMAN metabotropic glutamate 5 | metabotropic glutamate 5a
Type:
Enzyme
Mol. Mass.:
132484.72
Organism:
Homo sapiens (Human)
Description:
Residue:
1212
  
Inhibitor
Name:
BDBM50181768
Synonyms:
2-methyl-4-(2-thienylethynyl)thiazole | CHEMBL202331
Type:
Small organic molecule
Emp. Form.:
C10H7NS2
Mol. Mass.:
205.299
SMILES:
Cc1nc(cs1)C#Cc1cccs1
: