Target
Focal adhesion kinase 1
Ligand
BDBM50182014
Substrate
Meas. Tech.
ChEMBL_347197 (CHEMBL865637)
IC50
100±n/a nM
Citation
 Choi, HSWang, ZRichmond, WHe, XYang, KJiang, TSim, TKaranewsky, DGu, XJZhou, VLiu, YOhmori, OCaldwell, JGray, NHe, Y Design and synthesis of 7H-pyrrolo[2,3-d]pyrimidines as focal adhesion kinase inhibitors. Part 1. Bioorg Med Chem Lett 16:2173-6 (2006)  
Target
Name:
Focal adhesion kinase 1
Synonyms:
FADK 1 FAK1 FLT4 Focal adhesion kinase (FAK) Focal adhesion kinase 1 (FAK) Focal adhesion kinase-related nonkinase PTK2 Protein-tyrosine kinase 2 p125FAK | pp125FAK
Type:
Tyrosine-protein kinase
Mol. Mass.:
119233.17
Organism:
Homo sapiens (Human)
Description:
Q05397
Residue:
1052
  
Inhibitor
Name:
BDBM50182014
Synonyms:
7-(pyridin-2-yl)-N-(3,4,5-trimethoxyphenyl)-6,7-dihydro-5H-pyrrolo[2,3-d]pyrimidin-2-amine | CHEMBL383241
Type:
Small organic molecule
Emp. Form.:
C20H21N5O3
Mol. Mass.:
379.4124
SMILES:
COc1cc(Nc2ncc3CCN(c3n2)c2ccccn2)cc(OC)c1OC
: