Target
HLA class II histocompatibility antigen gamma chain
Ligand
BDBM50182101
Substrate
Meas. Tech.
ChEMBL_347360 (CHEMBL865649)
IC50
1300±n/a nM
Citation
 Grice, CATays, KKhatuya, HGustin, DJButler, CRWei, JSehon, CASun, SGu, YJiang, WThurmond, RLKarlsson, LEdwards, JP The SAR of 4-substituted (6,6-bicyclic) piperidine cathepsin S inhibitors. Bioorg Med Chem Lett 16:2209-12 (2006)  
Target
Name:
HLA class II histocompatibility antigen gamma chain
Synonyms:
CD74 HG2A_HUMAN | HLA-DR antigens-associated invariant chain
Type:
PROTEIN
Mol. Mass.:
33525.85
Organism:
Homo sapiens (Human)
Description:
ChEMBL_347360
Residue:
296
  
Inhibitor
Name:
BDBM50182101
Synonyms:
1-[4-(6-Chloro-2,2-dioxo-3,4-dihydro-2H-2lambda*6*-benzo[1,2,6]thiadiazin-1-yl)-piperidin-1-yl]-3-[5-methanesulfonyl-3-(4-trifluoromethyl-phenyl)-4,5,6,7-tetrahydro-pyrazolo[4,3-c]pyridin-1-yl]-propan-2-ol | CHEMBL203102
Type:
Small organic molecule
Emp. Form.:
C29H34ClF3N6O5S2
Mol. Mass.:
703.196
SMILES:
CS(=O)(=O)N1CCc2c(C1)c(nn2CC(O)CN1CCC(CC1)N1c2ccc(Cl)cc2CNS1(=O)=O)-c1ccc(cc1)C(F)(F)F
: