Target
Cathepsin S
Ligand
BDBM50182111
Substrate
Meas. Tech.
ChEMBL_347359 (CHEMBL865648)
IC50
1775±n/a nM
Citation
 Grice, CATays, KKhatuya, HGustin, DJButler, CRWei, JSehon, CASun, SGu, YJiang, WThurmond, RLKarlsson, LEdwards, JP The SAR of 4-substituted (6,6-bicyclic) piperidine cathepsin S inhibitors. Bioorg Med Chem Lett 16:2209-12 (2006)  
Target
Name:
Cathepsin S
Synonyms:
CATS_HUMAN Cathepsin S (Cat S) | cathepsin S preproprotein
Type:
Protein
Mol. Mass.:
37507.38
Organism:
Homo sapiens (Human)
Description:
P25774
Residue:
331
  
Inhibitor
Name:
BDBM50182111
Synonyms:
1-(3-(4-bromophenyl)-5-(methylsulfonyl)-4,5,6,7-tetrahydropyrazolo[4,3-c]pyridin-1-yl)-3-(4-(3,4-dihydroisoquinolin-2(1H)-yl)piperidin-1-yl)propan-2-ol | CHEMBL446116
Type:
Small organic molecule
Emp. Form.:
C30H38BrN5O3S
Mol. Mass.:
628.623
SMILES:
CS(=O)(=O)N1CCc2c(C1)c(nn2CC(O)CN1CCC(CC1)N1CCc2ccccc2C1)-c1ccc(Br)cc1
: