Target
Gamma-aminobutyric acid receptor subunit alpha-3/beta-3/gamma-2
Ligand
BDBM50179855
Substrate
Meas. Tech.
ChEMBL_333415 (CHEMBL853069)
Ki
2±n/a nM
Citation
 Russell, MGCarling, RWStreet, LJHallett, DJGoodacre, SMezzogori, EReader, MCook, SMBromidge, FANewman, RSmith, AJWafford, KAMarshall, GRReynolds, DSDias, RFerris, PStanley, JLincoln, RTye, SJSheppard, WFSohal, BPike, ADominguez, MAtack, JRCastro, JL Discovery of imidazo[1,2-b][1,2,4]triazines as GABA(A) alpha2/3 subtype selective agonists for the treatment of anxiety. J Med Chem 49:1235-8 (2006)  
Target
Name:
Gamma-aminobutyric acid receptor subunit alpha-3/beta-3/gamma-2
Synonyms:
GABA receptor alpha-3/beta-3/gamma-2 subunit | GABA-A receptor; alpha-3/beta-3/gamma-2
Type:
Mol. Mass.:
Description:
ASSAY_ID of EBI is 68410
Components:
This complex has 3 components.
Component 1
Name:
Gamma-aminobutyric acid receptor subunit gamma-2
Synonyms:
GABA(A) receptor subunit gamma-2 GBRG2_HUMAN
Type:
PROTEIN
Mol. Mass.:
54172.74
Organism:
Homo sapiens (Human)
Description:
EBI_217
Residue:
467
  
Component 2
Name:
Gamma-aminobutyric acid receptor subunit beta-3
Synonyms:
GABA A receptor alpha-4/beta-3/gamma-2 GABA-A receptor GBRB3_HUMAN | agonist GABA site
Type:
PROTEIN
Mol. Mass.:
54130.51
Organism:
Homo sapiens (Human)
Description:
ChEMBL_448071
Residue:
473
  
Component 3
Name:
Gamma-aminobutyric acid receptor subunit alpha-3
Synonyms:
GABA A Alpha3Beta3Gamma2 GABA C GABA-A receptor GBRA3_HUMAN agonist GABA site
Type:
Enzyme Catalytic Domain
Mol. Mass.:
55175.47
Organism:
Homo sapiens (Human)
Description:
GABA A Alpha3Beta1Gamma2 0 HUMAN::P34903
Residue:
492
  
Inhibitor
Name:
BDBM50179855
Synonyms:
6,2'-Difluoro-5'-[3-(1-hydroxy-1-methyl-ethyl)-imidazo[1,2-b][1,2,4]triazin-7-yl]-biphenyl-2-carbonitrile CHEMBL204696
Type:
Small organic molecule
Emp. Form.:
C21H15F2N5O
Mol. Mass.:
391.3735
SMILES:
CC(C)(O)c1cnn2c(cnc2n1)-c1ccc(F)c(c1)-c1c(F)cccc1C#N
: