Target
3-dehydroquinate dehydratase
Ligand
BDBM50182477
Substrate
Meas. Tech.
ChEMBL_332876 (CHEMBL858936)
Kd
20000±n/a nM
Citation
 Robinson, DAStewart, KAPrice, NCChalk, PACoggins, JRLapthorn, AJ Crystal structures of Helicobacter pylori type II dehydroquinase inhibitor complexes: new directions for inhibitor design. J Med Chem 49:1282-90 (2006)  
Target
Name:
3-dehydroquinate dehydratase
Synonyms:
AROQ_HELPY | aroQ
Type:
PROTEIN
Mol. Mass.:
18479.08
Organism:
Helicobacter pylori
Description:
ChEMBL_766424
Residue:
167
  
Inhibitor
Name:
BDBM50182477
Synonyms:
CHEMBL202311 N-tetrazol-5-yl-9-oxo-9H-xanthene-2-sulfonamide
Type:
Small organic molecule
Emp. Form.:
C14H9N5O4S
Mol. Mass.:
343.317
SMILES:
O=c1c2ccccc2oc2ccc(cc12)S(=O)(=O)Nc1nnn[nH]1
: