Target
Tissue alpha-L-fucosidase
Ligand
BDBM50182797
Substrate
Meas. Tech.
ChEMBL_344329 (CHEMBL868411)
Ki
500±n/a nM
Citation
 Greimel, PHäusler, HLundt, IRupitz, KStütz, AETarling, CAWithers, SGWrodnigg, TM Fluorescent glycosidase inhibiting 1,5-dideoxy-1,5-iminoalditols. Bioorg Med Chem Lett 16:2067-70 (2006)  
Target
Name:
Tissue alpha-L-fucosidase
Synonyms:
Alpha-L-fucosidase I FUCA1 Tissue alpha-L-fucosidase
Type:
PROTEIN
Mol. Mass.:
53690.69
Organism:
Homo sapiens (Human)
Description:
ChEMBL_34088
Residue:
466
  
Inhibitor
Name:
BDBM50182797
Synonyms:
5-(dimethylamino)-N-(6-((2S,3R,4S,5R)-3,4,5-trihydroxy-2-methylpiperidin-1-yl)hexyl)naphthalene-1-sulfonamide | CHEMBL205277
Type:
Small organic molecule
Emp. Form.:
C24H37N3O5S
Mol. Mass.:
479.633
SMILES:
C[C@H]1[C@@H](O)[C@@H](O)[C@H](O)CN1CCCCCCNS(=O)(=O)c1cccc2c(cccc12)N(C)C
: