Target
Inosine-5'-monophosphate dehydrogenase 2
Ligand
BDBM50182886
Substrate
Meas. Tech.
ChEMBL_351034 (CHEMBL866259)
IC50
5840±n/a nM
Citation
 Beevers, REBuckley, GMDavies, NFraser, JLGalvin, FCHannah, DRHaughan, AFJenkins, KMack, SRPitt, WRRatcliffe, AJRichard, MDSabin, VSharpe, AWilliams, SC Low molecular weight indole fragments as IMPDH inhibitors. Bioorg Med Chem Lett 16:2535-8 (2006)  
Target
Name:
Inosine-5'-monophosphate dehydrogenase 2
Synonyms:
IMDH2_HUMAN IMPD 2 IMPDH-II Inosine 5'-monophosphate dehydrogenase II (IMPDH II) Inosine-5 -monophosphate dehydrogenase 2 | Inosine-5'-monophosphate dehydrogenase (IMPDH)
Type:
Enzyme
Mol. Mass.:
55806.87
Organism:
Homo sapiens (Human)
Description:
Recombinant IMPDH2 expressed in E. coli.
Residue:
514
  
Inhibitor
Name:
BDBM50182886
Synonyms:
3-(furan-3-yl)-1H-indole | CHEMBL381132
Type:
Small organic molecule
Emp. Form.:
C12H9NO
Mol. Mass.:
183.206
SMILES:
c1cc(co1)-c1c[nH]c2ccccc12
: