Target
Delta-type opioid receptor
Ligand
BDBM50182941
Substrate
Meas. Tech.
ChEMBL_349385 (CHEMBL863860)
Ki
1130±n/a nM
Citation
 Breslin, HJCai, CMiskowski, TACoutinho, SVZhang, SPHornby, PHe, W Identification of potent phenyl imidazoles as opioid receptor agonists. Bioorg Med Chem Lett 16:2505-8 (2006)  
Target
Name:
Delta-type opioid receptor
Synonyms:
Cytochrome P450 3A4 Delta opioid receptor Delta-type opioid receptor (DOR) OPRD_RAT Opioid receptor Opioid receptors; mu & delta Ror-a | Voltage-gated potassium channel
Type:
G Protein-Coupled Receptor (GPCR)
Mol. Mass.:
40465.04
Organism:
Rattus norvegicus (rat)
Description:
Competition binding assays were using CHO-K1 cell membranes expressing the opioid receptor.
Residue:
372
  
Inhibitor
Name:
BDBM50182941
Synonyms:
(S)-2-amino-3-(4-chlorophenyl)-1-((S)-3-(4-phenyl-1H-imidazol-2-yl)-3,4-dihydroisoquinolin-2(1H)-yl)propan-1-one | CHEMBL205281
Type:
Small organic molecule
Emp. Form.:
C27H25ClN4O
Mol. Mass.:
456.967
SMILES:
N[C@@H](Cc1ccc(Cl)cc1)C(=O)N1Cc2ccccc2C[C@H]1c1nc(c[nH]1)-c1ccccc1
: