Target
Mu-type opioid receptor
Ligand
BDBM50182947
Substrate
Meas. Tech.
ChEMBL_349386 (CHEMBL863863)
Ki
23±n/a nM
Citation
 Breslin, HJCai, CMiskowski, TACoutinho, SVZhang, SPHornby, PHe, W Identification of potent phenyl imidazoles as opioid receptor agonists. Bioorg Med Chem Lett 16:2505-8 (2006)  
Target
Name:
Mu-type opioid receptor
Synonyms:
MOR-1 Mu-type opioid receptor (MOR) OPRM_RAT Opioid receptor B Ror-b
Type:
G Protein-Coupled Receptor (GPCR)
Mol. Mass.:
44503.11
Organism:
Rattus norvegicus (rat)
Description:
Competition binding assays were carried out using membrane preparations from transfected HN9.10 cells that constitutively expressed the mu opioid receptor.
Residue:
398
  
Inhibitor
Name:
BDBM50182947
Synonyms:
4-((S)-2-amino-3-oxo-3-((S)-3-(4-phenyl-1H-imidazol-2-yl)-3,4-dihydroisoquinolin-2(1H)-yl)propyl)benzamide | CHEMBL205388
Type:
Small organic molecule
Emp. Form.:
C28H27N5O2
Mol. Mass.:
465.5463
SMILES:
N[C@@H](Cc1ccc(cc1)C(N)=O)C(=O)N1Cc2ccccc2C[C@H]1c1nc(c[nH]1)-c1ccccc1
: