Target
Integrase
Ligand
BDBM50183273
Substrate
Meas. Tech.
ChEMBL_336353 (CHEMBL865324)
IC50
7.2±n/a nM
Citation
 Sato, MMotomura, TAramaki, HMatsuda, TYamashita, MIto, YKawakami, HMatsuzaki, YWatanabe, WYamataka, KIkeda, SKodama, EMatsuoka, MShinkai, H Novel HIV-1 integrase inhibitors derived from quinolone antibiotics. J Med Chem 49:1506-8 (2006)  
Target
Name:
Integrase
Synonyms:
Human immunodeficiency virus type 1 integrase
Type:
PROTEIN
Mol. Mass.:
32231.48
Organism:
Human immunodeficiency virus 1
Description:
ChEMBL_90865
Residue:
288
  
Inhibitor
Name:
BDBM50183273
Synonyms:
(S)-6-(3-chloro-2-fluorobenzyl)-1-(1-hydroxy-3-methylbutan-2-yl)-7-methoxy-4-oxo-1,4-dihydroquinoline-3-carboxylic acid 6-(3-chloro-2-fluorobenzyl)-1-[(1S)-1-(hydroxymethyl)-2-methylpropyl]-7-methoxy-4-oxo-1,4-dihydroquinoline-3-carboxylic acid ELVITEGRAVIR
Type:
Small organic molecule
Emp. Form.:
C23H23ClFNO5
Mol. Mass.:
447.884
SMILES:
COc1cc2n(cc(C(O)=O)c(=O)c2cc1Cc1cccc(Cl)c1F)[C@H](CO)C(C)C
: