Target
Integrase
Ligand
BDBM50183274
Substrate
Meas. Tech.
ChEMBL_336353 (CHEMBL865324)
IC50
9.1±n/a nM
Citation
 Sato, MMotomura, TAramaki, HMatsuda, TYamashita, MIto, YKawakami, HMatsuzaki, YWatanabe, WYamataka, KIkeda, SKodama, EMatsuoka, MShinkai, H Novel HIV-1 integrase inhibitors derived from quinolone antibiotics. J Med Chem 49:1506-8 (2006)  
Target
Name:
Integrase
Synonyms:
Human immunodeficiency virus type 1 integrase
Type:
PROTEIN
Mol. Mass.:
32231.48
Organism:
Human immunodeficiency virus 1
Description:
ChEMBL_90865
Residue:
288
  
Inhibitor
Name:
BDBM50183274
Synonyms:
6-(3-Chloro-2-fluorobenzyl)-1-(2-hydroxyethyl)-7-methoxy-4-oxo-1,4-dihydroquinoline-3-carboxylic acid | CHEMBL203443
Type:
Small organic molecule
Emp. Form.:
C20H17ClFNO5
Mol. Mass.:
405.804
SMILES:
COc1cc2n(CCO)cc(C(O)=O)c(=O)c2cc1Cc1cccc(Cl)c1F
: