Target
Proto-oncogene tyrosine-protein kinase Src
Ligand
BDBM50142887
Substrate
Meas. Tech.
ChEMBL_336777 (CHEMBL864338)
Ki
500±n/a nM
Citation
 Carraro, FNaldini, APucci, ALocatelli, GAMaga, GSchenone, SBruno, ORanise, ABondavalli, FBrullo, CFossa, PMenozzi, GMosti, LModugno, MTintori, CManetti, FBotta, M Pyrazolo[3,4-d]pyrimidines as potent antiproliferative and proapoptotic agents toward A431 and 8701-BC cells in culture via inhibition of c-Src phosphorylation. J Med Chem 49:1549-61 (2006)  
Target
Name:
Proto-oncogene tyrosine-protein kinase Src
Synonyms:
Calmodulin/Proto-oncogene tyrosine-protein kinase Src Proto-oncogene c-Src SRC SRC_HUMAN V-src sarcoma (Schmidt-Ruppin A-2) viral oncogene homolog (avian) p60-Src | pp60c-src
Type:
Protein
Mol. Mass.:
59838.60
Organism:
Homo sapiens (Human)
Description:
P12931
Residue:
536
  
Inhibitor
Name:
BDBM50142887
Synonyms:
1-(tert-butyl)-3-(4-chlorophenyl)-4-aminopyrazolo[3,4-d]pyrimidine 1-tert-butyl-3-(4-chlorophenyl)-1H-pyrazolo[3,4-d]pyrimidin-4-amine 4-amino-5-(4-chlorophenyl)-7-(tert-butyl)pyrazolo[3,4-d]pyrimidine CHEMBL406845 US10544104, Compound 146 US11701353, PP2 (Pfizer) cid_4878
Type:
Small organic molecule
Emp. Form.:
C15H16ClN5
Mol. Mass.:
301.774
SMILES:
CC(C)(C)n1nc(-c2ccc(Cl)cc2)c2c(N)ncnc12
: