Target
Proto-oncogene tyrosine-protein kinase Src
Ligand
BDBM50183352
Substrate
Meas. Tech.
ChEMBL_336777 (CHEMBL864338)
Ki
9600±n/a nM
Citation
 Carraro, FNaldini, APucci, ALocatelli, GAMaga, GSchenone, SBruno, ORanise, ABondavalli, FBrullo, CFossa, PMenozzi, GMosti, LModugno, MTintori, CManetti, FBotta, M Pyrazolo[3,4-d]pyrimidines as potent antiproliferative and proapoptotic agents toward A431 and 8701-BC cells in culture via inhibition of c-Src phosphorylation. J Med Chem 49:1549-61 (2006)  
Target
Name:
Proto-oncogene tyrosine-protein kinase Src
Synonyms:
Calmodulin/Proto-oncogene tyrosine-protein kinase Src Proto-oncogene c-Src SRC SRC_HUMAN V-src sarcoma (Schmidt-Ruppin A-2) viral oncogene homolog (avian) p60-Src | pp60c-src
Type:
Protein
Mol. Mass.:
59838.60
Organism:
Homo sapiens (Human)
Description:
P12931
Residue:
536
  
Inhibitor
Name:
BDBM50183352
Synonyms:
1-(2-bromo-2-phenylethyl)-4-(pyrrolidin-1-yl)-1H-pyrazolo[3,4-d]pyrimidine | CHEMBL382012
Type:
Small organic molecule
Emp. Form.:
C17H18BrN5
Mol. Mass.:
372.262
SMILES:
BrC(Cn1ncc2c(ncnc12)N1CCCC1)c1ccccc1
: