Target
RNA-directed RNA polymerase
Ligand
BDBM50183484
Substrate
Meas. Tech.
ChEMBL_337086 (CHEMBL862541)
IC50
>25000±n/a nM
Citation
 Koch, UAttenni, BMalancona, SColarusso, SConte, IDi Filippo, MHarper, SPacini, BGiomini, CThomas, SIncitti, ITomei, LDe Francesco, RAltamura, SMatassa, VGNarjes, F 2-(2-Thienyl)-5,6-dihydroxy-4-carboxypyrimidines as inhibitors of the hepatitis C virus NS5B polymerase: discovery, SAR, modeling, and mutagenesis. J Med Chem 49:1693-705 (2006)  
Target
Name:
RNA-directed RNA polymerase
Synonyms:
Hepatitis C virus NS5B RNA-dependent RNA polymerase | NS5B protein
Type:
Protein
Mol. Mass.:
25173.95
Organism:
Hepatitis C virus
Description:
Q8JXU8
Residue:
229
  
Inhibitor
Name:
BDBM50183484
Synonyms:
2-cyclohexyl-5,6-dihydroxypyrimidine-4-carboxylic acid | CHEMBL203976
Type:
Small organic molecule
Emp. Form.:
C11H14N2O4
Mol. Mass.:
238.2399
SMILES:
OC(=O)c1nc([nH]c(=O)c1O)C1CCCCC1
: