Target
Sodium-dependent serotonin transporter
Ligand
BDBM50183548
Substrate
Meas. Tech.
ChEMBL_335143 (CHEMBL867623)
Ki
450±n/a nM
Citation
 Greiner, EBoos, TLPrisinzano, TEDe Martino, MGZeglis, BDersch, CMMarcus, JPartilla, JSRothman, RBJacobson, AERice, KC Design and synthesis of promiscuous high-affinity monoamine transporter ligands: unraveling transporter selectivity. J Med Chem 49:1766-72 (2006)  
Target
Name:
Sodium-dependent serotonin transporter
Synonyms:
5-HT Transporter 5HTT SC6A4_HUMAN SLC6A4 Serotonin transporter (5HTT) Sodium-dependent serotonin transporter (SERT) | Solute carrier family 6 member 4
Type:
Multi-pass membrane protein
Mol. Mass.:
70322.51
Organism:
Homo sapiens (Human)
Description:
P31645
Residue:
630
  
Inhibitor
Name:
BDBM50183548
Synonyms:
(S)-(+)-4-(2-benzhydryloxyethyl)-1-(3-phenylpropan-2-ol)-piperidine oxalate | CHEMBL204586
Type:
Small organic molecule
Emp. Form.:
C29H35NO2
Mol. Mass.:
429.5937
SMILES:
O[C@H](CN1CCC(CCOC(c2ccccc2)c2ccccc2)CC1)Cc1ccccc1
: