Target
Sodium-dependent noradrenaline transporter
Ligand
BDBM50183539
Substrate
Meas. Tech.
ChEMBL_335144 (CHEMBL867624)
Ki
947±n/a nM
Citation
 Greiner, EBoos, TLPrisinzano, TEDe Martino, MGZeglis, BDersch, CMMarcus, JPartilla, JSRothman, RBJacobson, AERice, KC Design and synthesis of promiscuous high-affinity monoamine transporter ligands: unraveling transporter selectivity. J Med Chem 49:1766-72 (2006)  
Target
Name:
Sodium-dependent noradrenaline transporter
Synonyms:
Monoamine transporter NET Noradrenaline Transporter (NET) Norepinephrine transporter protein (NET) SLC6A2 Sodium-dependent noradrenaline transporter (NET) | Solute carrier family 6 member 2
Type:
Multi-pass membrane protein
Mol. Mass.:
69337.72
Organism:
Homo sapiens (Human)
Description:
P23975
Residue:
617
  
Inhibitor
Name:
BDBM50183539
Synonyms:
CHEMBL381256 trans-(R,R)-4-[2-[bis-(4-fluorophenyl)methoxy]ethyl]-1-(2-phenyl-cyclopropylmethyl)-piperidine oxalate
Type:
Small organic molecule
Emp. Form.:
C30H33F2NO
Mol. Mass.:
461.5859
SMILES:
Fc1ccc(cc1)C(OCCC1CCN(C[C@@H]2C[C@H]2c2ccccc2)CC1)c1ccc(F)cc1
: