Target
Sodium-dependent noradrenaline transporter
Ligand
BDBM50183537
Substrate
Meas. Tech.
ChEMBL_335149 (CHEMBL867629)
Ki
338±n/a nM
Citation
 Greiner, EBoos, TLPrisinzano, TEDe Martino, MGZeglis, BDersch, CMMarcus, JPartilla, JSRothman, RBJacobson, AERice, KC Design and synthesis of promiscuous high-affinity monoamine transporter ligands: unraveling transporter selectivity. J Med Chem 49:1766-72 (2006)  
Target
Name:
Sodium-dependent noradrenaline transporter
Synonyms:
Monoamine transporter NET Noradrenaline Transporter (NET) Norepinephrine transporter protein (NET) SLC6A2 Sodium-dependent noradrenaline transporter (NET) | Solute carrier family 6 member 2
Type:
Multi-pass membrane protein
Mol. Mass.:
69337.72
Organism:
Homo sapiens (Human)
Description:
P23975
Residue:
617
  
Inhibitor
Name:
BDBM50183537
Synonyms:
(S)-(+)-1-(2-amino-3-phenylpropyl)-4-[2-[bis-(4-fluorophenyl)-methoxy]ethyl]piperidine dioxalate | CHEMBL381842
Type:
Small organic molecule
Emp. Form.:
C29H34F2N2O
Mol. Mass.:
464.5899
SMILES:
N[C@H](CN1CCC(CCOC(c2ccc(F)cc2)c2ccc(F)cc2)CC1)Cc1ccccc1
: