Target
Sodium-dependent serotonin transporter
Ligand
BDBM50183538
Substrate
Meas. Tech.
ChEMBL_335143 (CHEMBL867623)
Ki
13±n/a nM
Citation
 Greiner, EBoos, TLPrisinzano, TEDe Martino, MGZeglis, BDersch, CMMarcus, JPartilla, JSRothman, RBJacobson, AERice, KC Design and synthesis of promiscuous high-affinity monoamine transporter ligands: unraveling transporter selectivity. J Med Chem 49:1766-72 (2006)  
Target
Name:
Sodium-dependent serotonin transporter
Synonyms:
5-HT Transporter 5HTT SC6A4_HUMAN SLC6A4 Serotonin transporter (5HTT) Sodium-dependent serotonin transporter (SERT) | Solute carrier family 6 member 4
Type:
Multi-pass membrane protein
Mol. Mass.:
70322.51
Organism:
Homo sapiens (Human)
Description:
P31645
Residue:
630
  
Inhibitor
Name:
BDBM50183538
Synonyms:
(R)-(+)-4-[2-[bis-(4-fluorophenyl)methoxy]ethyl]-1-(4-phenylbutan-2-ol)-piperidine oxalate | CHEMBL202860
Type:
Small organic molecule
Emp. Form.:
C30H35F2NO2
Mol. Mass.:
479.6012
SMILES:
O[C@H](CCc1ccccc1)CN1CCC(CCOC(c2ccc(F)cc2)c2ccc(F)cc2)CC1
: