Target
Sodium-dependent noradrenaline transporter
Ligand
BDBM50183540
Substrate
Meas. Tech.
ChEMBL_335144 (CHEMBL867624)
Ki
440±n/a nM
Citation
 Greiner, EBoos, TLPrisinzano, TEDe Martino, MGZeglis, BDersch, CMMarcus, JPartilla, JSRothman, RBJacobson, AERice, KC Design and synthesis of promiscuous high-affinity monoamine transporter ligands: unraveling transporter selectivity. J Med Chem 49:1766-72 (2006)  
Target
Name:
Sodium-dependent noradrenaline transporter
Synonyms:
Monoamine transporter NET Noradrenaline Transporter (NET) Norepinephrine transporter protein (NET) SLC6A2 Sodium-dependent noradrenaline transporter (NET) | Solute carrier family 6 member 2
Type:
Multi-pass membrane protein
Mol. Mass.:
69337.72
Organism:
Homo sapiens (Human)
Description:
P23975
Residue:
617
  
Inhibitor
Name:
BDBM50183540
Synonyms:
(S)-(-)-4-[2-[bis-(4-fluorophenyl)methoxy]ethyl]-1-(3-phenylpropan-3-ol)-piperidine oxalate | CHEMBL205025
Type:
Small organic molecule
Emp. Form.:
C29H33F2NO2
Mol. Mass.:
465.5746
SMILES:
O[C@@H](CCN1CCC(CCOC(c2ccc(F)cc2)c2ccc(F)cc2)CC1)c1ccccc1
: