Target
Matrix metalloproteinase-9
Ligand
BDBM50183727
Substrate
Meas. Tech.
ChEMBL_354461 (CHEMBL853096)
Ki
>2128±n/a nM
Citation
 Gilmore, JLKing, BWHarris, CMaduskuie, TMercer, SELiu, RQCovington, MBQian, MRibadeneria, MDVaddi, KTrzaskos, JMNewton, RCDecicco, CPDuan, JJ Synthesis and structure-activity relationship of a novel, achiral series of TNF-alpha converting enzyme inhibitors. Bioorg Med Chem Lett 16:2699-704 (2006)  
Target
Name:
Matrix metalloproteinase-9
Synonyms:
67 kDa matrix metalloproteinase-9 92 kDa gelatinase CLG4B Gelatinase B MMP9 Matrix metalloproteinase 9 (MMP-9) Matrix metalloproteinase-9 (MMP9)
Type:
Enzyme
Mol. Mass.:
78452.28
Organism:
Homo sapiens (Human)
Description:
P14780
Residue:
707
  
Inhibitor
Name:
BDBM50183727
Synonyms:
CHEMBL436950 | tert-butyl 4-(2-(hydroxyamino)-2-oxoethyl)-4-(4-((2-methylquinolin-4-yl)methoxy)benzamido)piperidine-1-carboxylate
Type:
Small organic molecule
Emp. Form.:
C30H36N4O6
Mol. Mass.:
548.63
SMILES:
Cc1cc(COc2ccc(cc2)C(=O)NC2(CC(=O)NO)CCN(CC2)C(=O)OC(C)(C)C)c2ccccc2n1
: