Target
Neutrophil collagenase
Ligand
BDBM50183711
Substrate
Meas. Tech.
ChEMBL_354471 (CHEMBL853106)
Ki
217±n/a nM
Citation
 Gilmore, JLKing, BWHarris, CMaduskuie, TMercer, SELiu, RQCovington, MBQian, MRibadeneria, MDVaddi, KTrzaskos, JMNewton, RCDecicco, CPDuan, JJ Synthesis and structure-activity relationship of a novel, achiral series of TNF-alpha converting enzyme inhibitors. Bioorg Med Chem Lett 16:2699-704 (2006)  
Target
Name:
Neutrophil collagenase
Synonyms:
CLG1 MMP8 Matrix metalloproteinase-8 PMNL collagenase | PMNL-CL
Type:
Enzyme
Mol. Mass.:
53413.48
Organism:
Homo sapiens (Human)
Description:
P22894
Residue:
467
  
Inhibitor
Name:
BDBM50183711
Synonyms:
CHEMBL208009 | N-(4-(2-(hydroxyamino)-2-oxoethyl)piperidin-4-yl)-4-((2-methylquinolin-4-yl)methoxy)benzamide
Type:
Small organic molecule
Emp. Form.:
C25H28N4O4
Mol. Mass.:
448.5142
SMILES:
Cc1cc(COc2ccc(cc2)C(=O)NC2(CC(=O)NO)CCNCC2)c2ccccc2n1
: