Target
Interstitial collagenase
Ligand
BDBM50183723
Substrate
Meas. Tech.
ChEMBL_354459 (CHEMBL870684)
Ki
>4949±n/a nM
Citation
 Gilmore, JLKing, BWHarris, CMaduskuie, TMercer, SELiu, RQCovington, MBQian, MRibadeneria, MDVaddi, KTrzaskos, JMNewton, RCDecicco, CPDuan, JJ Synthesis and structure-activity relationship of a novel, achiral series of TNF-alpha converting enzyme inhibitors. Bioorg Med Chem Lett 16:2699-704 (2006)  
Target
Name:
Interstitial collagenase
Synonyms:
CLG MMP1 Matrix metalloproteinase-1 | Matrix metalloproteinase-1 (MMP-1)
Type:
Enzyme
Mol. Mass.:
54010.26
Organism:
Homo sapiens (Human)
Description:
P03956
Residue:
469
  
Inhibitor
Name:
BDBM50183723
Synonyms:
CHEMBL207726 | N-(4-(2-(hydroxyamino)-2-oxoethyl)-1-isobutyrylpiperidin-4-yl)-4-((2-methylquinolin-4-yl)methoxy)benzamide
Type:
Small organic molecule
Emp. Form.:
C29H34N4O5
Mol. Mass.:
518.6041
SMILES:
CC(C)C(=O)N1CCC(CC(=O)NO)(CC1)NC(=O)c1ccc(OCc2cc(C)nc3ccccc23)cc1
: