Target
cAMP-specific 3',5'-cyclic phosphodiesterase 4A
Ligand
BDBM50183798
Substrate
Meas. Tech.
ChEMBL_353740 (CHEMBL866234)
IC50
0.6±n/a nM
Citation
 Lacombe, PDeschênes, DDubé, DDubé, LGallant, MMacdonald, DMastracchio, APerrier, HCharleson, SHuang, ZLaliberté, FLiu, SMancini, JAMasson, PSalem, MStyhler, AGirard, Y Nitrogen-bridged substituted 8-arylquinolines as potent PDE IV inhibitors. Bioorg Med Chem Lett 16:2608-12 (2006)  
Target
Name:
cAMP-specific 3',5'-cyclic phosphodiesterase 4A
Synonyms:
3',5'-cyclic phosphodiesterase PDE46 PDE4A_HUMAN Phosphodiesterase 4A | Phosphodiesterase 4A (PDE4)
Type:
Enzyme
Mol. Mass.:
98113.27
Organism:
Homo sapiens (Human)
Description:
P27815
Residue:
886
  
Inhibitor
Name:
BDBM50183798
Synonyms:
1-((2-fluoro-5-(6-(2-(methylsulfonyl)propan-2-yl)quinolin-8-yl)phenyl)methyl)-3-isopropyl-1-(4-(methylsulfonyl)phenyl)urea | CHEMBL208100
Type:
Small organic molecule
Emp. Form.:
C31H34FN3O5S2
Mol. Mass.:
611.747
SMILES:
CC(C)NC(=O)N(Cc1cc(ccc1F)-c1cc(cc2cccnc12)C(C)(C)S(C)(=O)=O)c1ccc(cc1)S(C)(=O)=O
: