Target
cAMP-specific 3',5'-cyclic phosphodiesterase 4A
Ligand
BDBM50183808
Substrate
Meas. Tech.
ChEMBL_353740 (CHEMBL866234)
IC50
0.2±n/a nM
Citation
 Lacombe, PDeschênes, DDubé, DDubé, LGallant, MMacdonald, DMastracchio, APerrier, HCharleson, SHuang, ZLaliberté, FLiu, SMancini, JAMasson, PSalem, MStyhler, AGirard, Y Nitrogen-bridged substituted 8-arylquinolines as potent PDE IV inhibitors. Bioorg Med Chem Lett 16:2608-12 (2006)  
Target
Name:
cAMP-specific 3',5'-cyclic phosphodiesterase 4A
Synonyms:
3',5'-cyclic phosphodiesterase PDE46 PDE4A_HUMAN Phosphodiesterase 4A | Phosphodiesterase 4A (PDE4)
Type:
Enzyme
Mol. Mass.:
98113.27
Organism:
Homo sapiens (Human)
Description:
P27815
Residue:
886
  
Inhibitor
Name:
BDBM50183808
Synonyms:
CHEMBL383225 | N-((3-(6-(2-cyanopropan-2-yl)quinolin-8-yl)phenyl)methyl)-N-(4-(methylsulfonyl)phenyl)benzamide
Type:
Small organic molecule
Emp. Form.:
C34H29N3O3S
Mol. Mass.:
559.677
SMILES:
CC(C)(C#N)c1cc(-c2cccc(CN(C(=O)c3ccccc3)c3ccc(cc3)S(C)(=O)=O)c2)c2ncccc2c1
: