Target
cAMP-specific 3',5'-cyclic phosphodiesterase 4D
Ligand
BDBM50183804
Substrate
Meas. Tech.
ChEMBL_353751 (CHEMBL866914)
IC50
0.5±n/a nM
Citation
 Lacombe, PDeschênes, DDubé, DDubé, LGallant, MMacdonald, DMastracchio, APerrier, HCharleson, SHuang, ZLaliberté, FLiu, SMancini, JAMasson, PSalem, MStyhler, AGirard, Y Nitrogen-bridged substituted 8-arylquinolines as potent PDE IV inhibitors. Bioorg Med Chem Lett 16:2608-12 (2006)  
Target
Name:
cAMP-specific 3',5'-cyclic phosphodiesterase 4D
Synonyms:
3',5'-cyclic phosphodiesterase PDE43 PDE4D_HUMAN | Phosphodiesterase 4D
Type:
Protein
Mol. Mass.:
91092.69
Organism:
Homo sapiens (Human)
Description:
Q08499
Residue:
809
  
Inhibitor
Name:
BDBM50183804
Synonyms:
4-(2-hydroxypropan-2-yl)-N-(4-(methylsulfonyl)phenyl)-N-(1-(3-(6-(2-(methylsulfonyl)propan-2-yl)quinolin-8-yl)phenyl)ethyl)benzamide | CHEMBL380933
Type:
Small organic molecule
Emp. Form.:
C38H40N2O6S2
Mol. Mass.:
684.864
SMILES:
CC(N(C(=O)c1ccc(cc1)C(C)(C)O)c1ccc(cc1)S(C)(=O)=O)c1cccc(c1)-c1cc(cc2cccnc12)C(C)(C)S(C)(=O)=O
: