Target
cAMP-specific 3',5'-cyclic phosphodiesterase 4D
Ligand
BDBM50183797
Substrate
Meas. Tech.
ChEMBL_353751 (CHEMBL866914)
IC50
0.7±n/a nM
Citation
 Lacombe, PDeschênes, DDubé, DDubé, LGallant, MMacdonald, DMastracchio, APerrier, HCharleson, SHuang, ZLaliberté, FLiu, SMancini, JAMasson, PSalem, MStyhler, AGirard, Y Nitrogen-bridged substituted 8-arylquinolines as potent PDE IV inhibitors. Bioorg Med Chem Lett 16:2608-12 (2006)  
Target
Name:
cAMP-specific 3',5'-cyclic phosphodiesterase 4D
Synonyms:
3',5'-cyclic phosphodiesterase PDE43 PDE4D_HUMAN | Phosphodiesterase 4D
Type:
Protein
Mol. Mass.:
91092.69
Organism:
Homo sapiens (Human)
Description:
Q08499
Residue:
809
  
Inhibitor
Name:
BDBM50183797
Synonyms:
CHEMBL207996 | N-(3,5-dichloropyridin-4-yl)-3-(6-(2-(methylsulfonyl)propan-2-yl)quinolin-8-yl)benzamide
Type:
Small organic molecule
Emp. Form.:
C25H21Cl2N3O3S
Mol. Mass.:
514.424
SMILES:
CC(C)(c1cc(-c2cccc(c2)C(=O)Nc2c(Cl)cncc2Cl)c2ncccc2c1)S(C)(=O)=O
: