Target
cAMP-specific 3',5'-cyclic phosphodiesterase 4B
Ligand
BDBM50183791
Substrate
Meas. Tech.
ChEMBL_353749 (CHEMBL866912)
IC50
0.3±n/a nM
Citation
 Lacombe, PDeschênes, DDubé, DDubé, LGallant, MMacdonald, DMastracchio, APerrier, HCharleson, SHuang, ZLaliberté, FLiu, SMancini, JAMasson, PSalem, MStyhler, AGirard, Y Nitrogen-bridged substituted 8-arylquinolines as potent PDE IV inhibitors. Bioorg Med Chem Lett 16:2608-12 (2006)  
Target
Name:
cAMP-specific 3',5'-cyclic phosphodiesterase 4B
Synonyms:
3',5'-cyclic phosphodiesterase Isoform PDE4B1 PDE4B PDE4B_HUMAN Phosphodiesterase 4B (PDE4B) Phosphodiesterase Type 4 (PDE4B)
Type:
Protein
Mol. Mass.:
83318.87
Organism:
Homo sapiens (Human)
Description:
Q07343
Residue:
736
  
Inhibitor
Name:
BDBM50183791
Synonyms:
CHEMBL209295 | isopropyl (3-(6-(2-cyanopropan-2-yl)quinolin-8-yl)phenyl)methyl(4-(methylsulfonyl)phenyl)carbamate
Type:
Small organic molecule
Emp. Form.:
C31H31N3O4S
Mol. Mass.:
541.661
SMILES:
CC(C)OC(=O)N(Cc1cccc(c1)-c1cc(cc2cccnc12)C(C)(C)C#N)c1ccc(cc1)S(C)(=O)=O
: