Target
cGMP-dependent protein kinase
Ligand
BDBM50183915
Substrate
Meas. Tech.
ChEMBL_350591 (CHEMBL868999)
IC50
0.35±n/a nM
Citation
 Qian, XLiang, GBFeng, DFisher, MCrumley, TRattray, SDulski, PMGurnett, ALeavitt, PSLiberator, PAMisura, ASSamaras, STamas, TSchmatz, DMWyvratt, MBiftu, T Synthesis and SAR studies of diarylpyrrole anticoccidial agents. Bioorg Med Chem Lett 16:2817-21 (2006)  
Target
Name:
cGMP-dependent protein kinase
Synonyms:
Type:
PROTEIN
Mol. Mass.:
112911.27
Organism:
Eimeria tenella
Description:
ChEMBL_469577
Residue:
1003
  
Inhibitor
Name:
BDBM50183915
Synonyms:
(5-(4-fluorophenyl)-4-(pyridin-4-yl)-1H-pyrrol-2-yl)-N,N-dimethylmethanamine | CHEMBL208434
Type:
Small organic molecule
Emp. Form.:
C18H18FN3
Mol. Mass.:
295.354
SMILES:
CN(C)Cc1cc(c([nH]1)-c1ccc(F)cc1)-c1ccncc1
: