Target
cGMP-dependent protein kinase
Ligand
BDBM50183918
Substrate
Meas. Tech.
ChEMBL_350591 (CHEMBL868999)
IC50
1±n/a nM
Citation
 Qian, XLiang, GBFeng, DFisher, MCrumley, TRattray, SDulski, PMGurnett, ALeavitt, PSLiberator, PAMisura, ASSamaras, STamas, TSchmatz, DMWyvratt, MBiftu, T Synthesis and SAR studies of diarylpyrrole anticoccidial agents. Bioorg Med Chem Lett 16:2817-21 (2006)  
Target
Name:
cGMP-dependent protein kinase
Synonyms:
Type:
PROTEIN
Mol. Mass.:
112911.27
Organism:
Eimeria tenella
Description:
ChEMBL_469577
Residue:
1003
  
Inhibitor
Name:
BDBM50183918
Synonyms:
4-(2-(4-fluorophenyl)-5-(1-methylpyrrolidin-2-yl)-1H-pyrrol-3-yl)pyridine | CHEMBL380546
Type:
Small organic molecule
Emp. Form.:
C20H20FN3
Mol. Mass.:
321.3913
SMILES:
CN1CCCC1c1cc(c([nH]1)-c1ccc(F)cc1)-c1ccncc1
: