Target
B1 bradykinin receptor
Ligand
BDBM50184209
Substrate
Meas. Tech.
ChEMBL_350972 (CHEMBL858907)
Ki
0.85±n/a nM
Citation
 Kuduk, SDDi Marco, CNChang, RKWood, MRKim, JJSchirripa, KMMurphy, KLRansom, RWTang, CTorrent, MHa, SPrueksaritanont, TPettibone, DJBock, MG 5-Piperazinyl pyridine carboxamide bradykinin B1 antagonists. Bioorg Med Chem Lett 16:2791-5 (2006)  
Target
Name:
B1 bradykinin receptor
Synonyms:
B1 BRADYKININ B1R BK-1 receptor BRADYB1 | Bradykinin B1 receptor
Type:
Enzyme
Mol. Mass.:
40508.87
Organism:
Homo sapiens (Human)
Description:
P46663
Residue:
353
  
Inhibitor
Name:
BDBM50184209
Synonyms:
4'-{[5-(4-cyclopropylmethyl-piperazine-1-carbonyl)-pyridin-2-ylamino]-methyl}-3,3'-difluoro-biphenyl-2-carboxylic acid methyl ester | CHEMBL207022
Type:
Small organic molecule
Emp. Form.:
C29H30F2N4O3
Mol. Mass.:
520.5703
SMILES:
COC(=O)c1c(F)cccc1-c1ccc(CNc2ccc(cn2)C(=O)N2CCN(CC3CC3)CC2)c(F)c1
: