Target
Prostaglandin D2 receptor
Ligand
BDBM50184228
Substrate
Meas. Tech.
ChEMBL_364757 (CHEMBL871219)
Ki
36±n/a nM
Citation
 Sturino, CFLachance, NBoyd, MBerthelette, CLabelle, MLi, LRoy, BScheigetz, JTsou, NBrideau, CCauchon, ECarriere, MCDenis, DGreig, GKargman, SLamontagne, SMathieu, MCSawyer, NSlipetz, DO'Neill, GWang, ZZamboni, RMetters, KMYoung, RN Identification of an indole series of prostaglandin D2 receptor antagonists. Bioorg Med Chem Lett 16:3043-8 (2006)  
Target
Name:
Prostaglandin D2 receptor
Synonyms:
PD2R_HUMAN Prostaglandin D2 Prostanoid DP receptor
Type:
Enzyme
Mol. Mass.:
40288.87
Organism:
Homo sapiens (Human)
Description:
Q13258
Residue:
359
  
Inhibitor
Name:
BDBM50184228
Synonyms:
2-(9-(4-chlorobenzyl)-2,3,4,9-tetrahydro-1H-carbazol-1-yl)acetic acid | CHEMBL206631
Type:
Small organic molecule
Emp. Form.:
C21H20ClNO2
Mol. Mass.:
353.842
SMILES:
OC(=O)CC1CCCc2c1n(Cc1ccc(Cl)cc1)c1ccccc21
: