Target
Thromboxane A2 receptor
Ligand
BDBM50184224
Substrate
Meas. Tech.
ChEMBL_364758 (CHEMBL871220)
Ki
820±n/a nM
Citation
 Sturino, CFLachance, NBoyd, MBerthelette, CLabelle, MLi, LRoy, BScheigetz, JTsou, NBrideau, CCauchon, ECarriere, MCDenis, DGreig, GKargman, SLamontagne, SMathieu, MCSawyer, NSlipetz, DO'Neill, GWang, ZZamboni, RMetters, KMYoung, RN Identification of an indole series of prostaglandin D2 receptor antagonists. Bioorg Med Chem Lett 16:3043-8 (2006)  
Target
Name:
Thromboxane A2 receptor
Synonyms:
Prostanoid TP receptor TBXA2R Thromboxane Thromboxane Beta
Type:
Enyzme
Mol. Mass.:
37445.28
Organism:
Homo sapiens (Human)
Description:
P21731
Residue:
343
  
Inhibitor
Name:
BDBM50184224
Synonyms:
2-(4-(4-tert-butylbenzyl)-5-bromo-7-(methylsulfonyl)-1,2,3,4-tetrahydrocyclopenta[b]indol-3-yl)acetic acid | CHEMBL208319
Type:
Small organic molecule
Emp. Form.:
C25H28BrNO4S
Mol. Mass.:
518.463
SMILES:
CC(C)(C)c1ccc(Cn2c3C(CC(O)=O)CCc3c3cc(cc(Br)c23)S(C)(=O)=O)cc1
: