Target
Prostaglandin E2 receptor EP4 subtype
Ligand
BDBM50184212
Substrate
Meas. Tech.
ChEMBL_364762 (CHEMBL854184)
Ki
>20000±n/a nM
Citation
 Sturino, CFLachance, NBoyd, MBerthelette, CLabelle, MLi, LRoy, BScheigetz, JTsou, NBrideau, CCauchon, ECarriere, MCDenis, DGreig, GKargman, SLamontagne, SMathieu, MCSawyer, NSlipetz, DO'Neill, GWang, ZZamboni, RMetters, KMYoung, RN Identification of an indole series of prostaglandin D2 receptor antagonists. Bioorg Med Chem Lett 16:3043-8 (2006)  
Target
Name:
Prostaglandin E2 receptor EP4 subtype
Synonyms:
PE2R4_HUMAN PGE2 receptor EP4 subtype PTGER4 Prostanoid EP4 receptor
Type:
Enzyme
Mol. Mass.:
53134.53
Organism:
Homo sapiens (Human)
Description:
P35408
Residue:
488
  
Inhibitor
Name:
BDBM50184212
Synonyms:
(R)-2-(4-(4-chlorobenzyl)-5-acetyl-7-(methylsulfonyl)-1,2,3,4-tetrahydrocyclopenta[b]indol-3-yl)acetic acid [(3R)-5-acetyl-4-(4-chlorobenzyl)-7-(methylsulfonyl)-1,2,3,4-tetrahydrocyclopenta[b]indol-3-yl]acetic acid | [(R)-5-Acetyl-4-(4-chloro-benzyl)-7-methanesulfonyl-1,2,3,4-tetrahydro-cyclopenta[b]indol-3-yl]-acetic acid
Type:
Small organic molecule
Emp. Form.:
C23H22ClNO5S
Mol. Mass.:
459.942
SMILES:
CC(=O)c1cc(cc2c3CC[C@H](CC(O)=O)c3n(Cc3ccc(Cl)cc3)c12)S(C)(=O)=O
: