Target
Heat shock protein HSP 90-alpha/90-beta
Ligand
BDBM50184282
Substrate
Meas. Tech.
ChEMBL_364998 (CHEMBL867504)
IC50
3000±n/a nM
Citation
 Avila, CHadden, MKMa, ZKornilayev, BAYe, QZBlagg, BS High-throughput screening for Hsp90 ATPase inhibitors. Bioorg Med Chem Lett 16:3005-8 (2006)  
Target
Name:
Heat shock protein HSP 90-alpha/90-beta
Synonyms:
Heat Shock Protein 90 (Hsp90) Heat shock protein HSP90
Type:
Mol. Mass.:
Description:
ASSAY_ID of EBI is 29664
Components:
This complex has 2 components.
Component 1
Name:
Heat shock protein HSP 90-alpha
Synonyms:
HS90A_HUMAN HSP86 HSP90AA1 HSPCA Heat shock 86 kDa Heat shock protein HSP 90-alpha (HSP90) LAP-2 Lipopolysaccharide-associated protein 2 heat shock protein 90kDa alpha (cytosolic), class A member 1 isoform 2
Type:
Molecular Chaperone
Mol. Mass.:
84623.45
Organism:
Homo sapiens (Human)
Description:
P07900
Residue:
732
  
Component 2
Name:
Heat shock protein HSP 90-beta
Synonyms:
HS90B_HUMAN HSP 90 HSP90B HSPCB Heat shock protein HSP 90 (Hsp90)
Type:
Molecular Chaperone
Mol. Mass.:
83229.45
Organism:
Homo sapiens (Human)
Description:
P08238
Residue:
724
  
Inhibitor
Name:
BDBM50184282
Synonyms:
4-methoxy-2-(3-(thiophen-2-yl)-1H-pyrazol-4-yl)phenol | CHEMBL209516
Type:
Small organic molecule
Emp. Form.:
C14H12N2O2S
Mol. Mass.:
272.322
SMILES:
COc1ccc(O)c(c1)-c1c[nH]nc1-c1cccs1
: