Target
D(1B) dopamine receptor
Ligand
BDBM50184434
Substrate
Meas. Tech.
ChEMBL_337504 (CHEMBL861438)
Ki
42.3±n/a nM
Citation
 Mohr, PDecker, MEnzensperger, CLehmann, J Dopamine/serotonin receptor ligands. 12(1): SAR studies on hexahydro-dibenz[d,g]azecines lead to 4-chloro-7-methyl-5,6,7,8,9,14-hexahydrodibenz[d,g]azecin-3-ol, the first picomolar D5-selective dopamine-receptor antagonist. J Med Chem 49:2110-6 (2006)  
Target
Name:
D(1B) dopamine receptor
Synonyms:
D(5) dopamine receptor DOPAMINE D5 DRD1L2 DRD5_HUMAN | dopamine receptor D5
Type:
Protein
Mol. Mass.:
52943.41
Organism:
Homo sapiens (Human)
Description:
P21918
Residue:
477
  
Inhibitor
Name:
BDBM50184434
Synonyms:
2-Hydroxy-7-methyl-5,6,7,8,9,14-hexahydrodibenzo[d,g]azecine | CHEMBL382010
Type:
Small organic molecule
Emp. Form.:
C18H21NO
Mol. Mass.:
267.3654
SMILES:
CN1CCc2ccccc2Cc2cc(O)ccc2CC1
: