Target
D(1B) dopamine receptor
Ligand
BDBM50184439
Substrate
Meas. Tech.
ChEMBL_337509 (CHEMBL861588)
Ki
0.54±n/a nM
Citation
 Mohr, PDecker, MEnzensperger, CLehmann, J Dopamine/serotonin receptor ligands. 12(1): SAR studies on hexahydro-dibenz[d,g]azecines lead to 4-chloro-7-methyl-5,6,7,8,9,14-hexahydrodibenz[d,g]azecin-3-ol, the first picomolar D5-selective dopamine-receptor antagonist. J Med Chem 49:2110-6 (2006)  
Target
Name:
D(1B) dopamine receptor
Synonyms:
D(5) dopamine receptor DOPAMINE D5 DRD1L2 DRD5_HUMAN | dopamine receptor D5
Type:
Protein
Mol. Mass.:
52943.41
Organism:
Homo sapiens (Human)
Description:
P21918
Residue:
477
  
Inhibitor
Name:
BDBM50184439
Synonyms:
3,11-Dihydroxy-7-methyl-5,6,7,8,9,14-hexahydrodibenzo[d,g]azecine | CHEMBL381936
Type:
Small organic molecule
Emp. Form.:
C18H21NO2
Mol. Mass.:
283.3648
SMILES:
CN1CCc2cc(O)ccc2Cc2ccc(O)cc2CC1
: