Target
D(1A) dopamine receptor
Ligand
BDBM50184437
Substrate
Meas. Tech.
ChEMBL_337501 (CHEMBL861434)
Ki
25.3±n/a nM
Citation
 Mohr, PDecker, MEnzensperger, CLehmann, J Dopamine/serotonin receptor ligands. 12(1): SAR studies on hexahydro-dibenz[d,g]azecines lead to 4-chloro-7-methyl-5,6,7,8,9,14-hexahydrodibenz[d,g]azecin-3-ol, the first picomolar D5-selective dopamine-receptor antagonist. J Med Chem 49:2110-6 (2006)  
Target
Name:
D(1A) dopamine receptor
Synonyms:
DA D1 receptor DRD1 Dopamine D1 receptor Dopamine D1A
Type:
Enzyme
Mol. Mass.:
49303.43
Organism:
Homo sapiens (Human)
Description:
P21728
Residue:
446
  
Inhibitor
Name:
BDBM50184437
Synonyms:
1,3-Dichloro-2-methoxy-7-methyl-5,6,7,8,9,14-hexahydrodibenzo[d,g]azecine | CHEMBL203734
Type:
Small organic molecule
Emp. Form.:
C19H21Cl2NO
Mol. Mass.:
350.282
SMILES:
COc1c(Cl)cc2CCN(C)CCc3ccccc3Cc2c1Cl
: