Target
D(2) dopamine receptor
Ligand
BDBM50184431
Substrate
Meas. Tech.
ChEMBL_337502 (CHEMBL861435)
Ki
2±n/a nM
Citation
 Mohr, PDecker, MEnzensperger, CLehmann, J Dopamine/serotonin receptor ligands. 12(1): SAR studies on hexahydro-dibenz[d,g]azecines lead to 4-chloro-7-methyl-5,6,7,8,9,14-hexahydrodibenz[d,g]azecin-3-ol, the first picomolar D5-selective dopamine-receptor antagonist. J Med Chem 49:2110-6 (2006)  
Target
Name:
D(2) dopamine receptor
Synonyms:
D(2) dopamine receptor DOPAMINE D2 Long DRD2 Dopamine D2 receptor Dopamine D2 receptor (D2R) Dopamine2-like | d2
Type:
Cell-surface receptors
Mol. Mass.:
50647.10
Organism:
Homo sapiens (Human)
Description:
P14416
Residue:
443
  
Inhibitor
Name:
BDBM50184431
Synonyms:
3-Chloro-2-hydroxy-7-methyl-5,6,7,8,9,14-hexahydrodibenzo[d,g]azecine | CHEMBL203047
Type:
Small organic molecule
Emp. Form.:
C18H20ClNO
Mol. Mass.:
301.811
SMILES:
CN1CCc2ccccc2Cc2cc(O)c(Cl)cc2CC1
: