Target
Cytosolic phospholipase A2
Ligand
BDBM50184566
Substrate
Meas. Tech.
ChEMBL_365214 (CHEMBL862421)
IC50
>50000±n/a nM
Citation
 Gopalsamy, AYang, HEllingboe, JWMcKew, JCTam, SJoseph-McCarthy, DZhang, WShen, MClark, JD 1,2,4-Oxadiazolidin-3,5-diones and 1,3,5-triazin-2,4,6-triones as cytosolic phospholipase A2alpha inhibitors. Bioorg Med Chem Lett 16:2978-81 (2006)  
Target
Name:
Cytosolic phospholipase A2
Synonyms:
CPLA2 PA24A_HUMAN PLA2G4A Phospholipase A2 | Phospholipase A2 group IVA
Type:
Protein
Mol. Mass.:
85219.30
Organism:
Homo sapiens (Human)
Description:
P47712
Residue:
749
  
Inhibitor
Name:
BDBM50184566
Synonyms:
4-(2-(2-(1,3-diphenylpropan-2-yl)-3,5-dioxo-1,2,4-oxadiazolidin-4-yl)ethoxy)benzoic acid | CHEMBL426678
Type:
Small organic molecule
Emp. Form.:
C26H24N2O6
Mol. Mass.:
460.4786
SMILES:
OC(=O)c1ccc(OCCn2c(=O)on(C(Cc3ccccc3)Cc3ccccc3)c2=O)cc1
: