Target
Cytosolic phospholipase A2
Ligand
BDBM50184549
Substrate
Meas. Tech.
ChEMBL_365214 (CHEMBL862421)
IC50
1600±n/a nM
Citation
 Gopalsamy, AYang, HEllingboe, JWMcKew, JCTam, SJoseph-McCarthy, DZhang, WShen, MClark, JD 1,2,4-Oxadiazolidin-3,5-diones and 1,3,5-triazin-2,4,6-triones as cytosolic phospholipase A2alpha inhibitors. Bioorg Med Chem Lett 16:2978-81 (2006)  
Target
Name:
Cytosolic phospholipase A2
Synonyms:
CPLA2 PA24A_HUMAN PLA2G4A Phospholipase A2 | Phospholipase A2 group IVA
Type:
Protein
Mol. Mass.:
85219.30
Organism:
Homo sapiens (Human)
Description:
P47712
Residue:
749
  
Inhibitor
Name:
BDBM50184549
Synonyms:
4-(4-(3-benzhydryl-5-ethyl-2,4,6-trioxo-1,3,5-triazinan-1-yl)but-2-enyloxy)benzoic acid | CHEMBL379366
Type:
Small organic molecule
Emp. Form.:
C29H27N3O6
Mol. Mass.:
513.5412
SMILES:
CCn1c(=O)n(C\C=C\COc2ccc(cc2)C(O)=O)c(=O)n(C(c2ccccc2)c2ccccc2)c1=O
: