Target
D(4) dopamine receptor
Ligand
BDBM50184795
Substrate
Meas. Tech.
ChEMBL_357154 (CHEMBL853173)
Ki
0.28±n/a nM
Citation
 Löber, SHübner, HGmeiner, P Synthesis and biological investigations of dopaminergic partial agonists preferentially recognizing the D4 receptor subtype. Bioorg Med Chem Lett 16:2955-9 (2006)  
Target
Name:
D(4) dopamine receptor
Synonyms:
D(2C) dopamine receptor DOPAMINE D4.2 DRD4 Dopamine D4 receptor
Type:
Enzyme
Mol. Mass.:
48373.19
Organism:
Homo sapiens (Human)
Description:
P21917
Residue:
419
  
Inhibitor
Name:
BDBM50184795
Synonyms:
1-(2-methoxyphenyl)-4-((1-phenyl-1H-pyrazol-4-yl)methyl)piperazine | CHEMBL379602
Type:
Small organic molecule
Emp. Form.:
C21H24N4O
Mol. Mass.:
348.4415
SMILES:
COc1ccccc1N1CCN(Cc2cnn(c2)-c2ccccc2)CC1
: