Target
Receptor-type tyrosine-protein kinase FLT3
Ligand
BDBM50185111
Substrate
Meas. Tech.
ChEMBL_358328 (CHEMBL868169)
IC50
27±n/a nM
Citation
 Patch, RJBaumann, CALiu, JGibbs, ACOtt, HLattanze, JPlayer, MR Identification of 2-acylaminothiophene-3-carboxamides as potent inhibitors of FLT3. Bioorg Med Chem Lett 16:3282-6 (2006)  
Target
Name:
Receptor-type tyrosine-protein kinase FLT3
Synonyms:
CD135 FL cytokine receptor FLK2 FLT3 Fetal liver kinase-2 Fms-like tyrosine kinase 3 (Flt-3) STK-1 Stem cell tyrosine kinase 1
Type:
Enzyme
Mol. Mass.:
112888.62
Organism:
Homo sapiens (Human)
Description:
P36888
Residue:
993
  
Inhibitor
Name:
BDBM50185111
Synonyms:
2-(3,4-dimethoxybenzamido)-5,6-dihydro-4H-cyclopenta[b]thiophene-3-carboxamide | CHEMBL210601
Type:
Small organic molecule
Emp. Form.:
C17H18N2O4S
Mol. Mass.:
346.401
SMILES:
COc1ccc(cc1OC)C(=O)Nc1sc2CCCc2c1C(N)=O
: