Target
Gamma-aminobutyric acid receptor subunit alpha-3/beta-2/gamma-2
Ligand
BDBM50185293
Substrate
Meas. Tech.
ChEMBL_341423 (CHEMBL861816)
Ki
26±n/a nM
Citation
 Lager, EAndersson, PNilsson, JPettersson, INielsen, EŘNielsen, MSterner, OLiljefors, T 4-quinolone derivatives: high-affinity ligands at the benzodiazepine site of brain GABA A receptors. synthesis, pharmacology, and pharmacophore modeling. J Med Chem 49:2526-33 (2006)  
Target
Name:
Gamma-aminobutyric acid receptor subunit alpha-3/beta-2/gamma-2
Synonyms:
GABA A receptor alpha-3/beta-2/gamma-2 | GABA receptor alpha-3/beta-2/gamma-2 subunit
Type:
Mol. Mass.:
Description:
ASSAY_ID of EBI is 69791
Components:
This complex has 3 components.
Component 1
Name:
Gamma-aminobutyric acid receptor subunit gamma-2
Synonyms:
GABA(A) receptor subunit gamma-2 GBRG2_HUMAN
Type:
PROTEIN
Mol. Mass.:
54172.74
Organism:
Homo sapiens (Human)
Description:
EBI_217
Residue:
467
  
Component 2
Name:
Gamma-aminobutyric acid receptor subunit beta-2
Synonyms:
GABA(A) receptor subunit beta-2 GBRB2_HUMAN
Type:
PROTEIN
Mol. Mass.:
59167.91
Organism:
Homo sapiens (Human)
Description:
EBI_221
Residue:
512
  
Component 3
Name:
Gamma-aminobutyric acid receptor subunit alpha-3
Synonyms:
GABA A Alpha3Beta3Gamma2 GABA C GABA-A receptor GBRA3_HUMAN agonist GABA site
Type:
Enzyme Catalytic Domain
Mol. Mass.:
55175.47
Organism:
Homo sapiens (Human)
Description:
GABA A Alpha3Beta1Gamma2 0 HUMAN::P34903
Residue:
492
  
Component 4
Name:
Gamma-aminobutyric acid receptor subunit beta-2
Synonyms:
GABA(A) receptor subunit beta-2 GBRB2_HUMAN
Type:
PROTEIN
Mol. Mass.:
59167.91
Organism:
Homo sapiens (Human)
Description:
EBI_221
Residue:
512
  
Inhibitor
Name:
BDBM50185293
Synonyms:
6-bromo-3-ethoxycarbonyl-4-quinolone | CHEMBL205257
Type:
Small organic molecule
Emp. Form.:
C12H10BrNO3
Mol. Mass.:
296.117
SMILES:
CCOC(=O)c1cnc2ccc(Br)cc2c1O
: