Target
Gamma-aminobutyric acid receptor subunit alpha-1/beta-2/gamma-2
Ligand
BDBM50185292
Substrate
Meas. Tech.
ChEMBL_341422 (CHEMBL861815)
Ki
0.27±n/a nM
Citation
 Lager, EAndersson, PNilsson, JPettersson, INielsen, EŘNielsen, MSterner, OLiljefors, T 4-quinolone derivatives: high-affinity ligands at the benzodiazepine site of brain GABA A receptors. synthesis, pharmacology, and pharmacophore modeling. J Med Chem 49:2526-33 (2006)  
Target
Name:
Gamma-aminobutyric acid receptor subunit alpha-1/beta-2/gamma-2
Synonyms:
GABA receptor alpha-1/beta-2/gamma-2 subunit | GABA-A receptor; alpha-1/beta-2/gamma-2
Type:
Protein
Mol. Mass.:
Description:
Components:
This complex has 3 components.
Component 1
Name:
Gamma-aminobutyric acid receptor subunit alpha-1
Synonyms:
Benzodiazepine central GABA A Benzodiazepine liver GABA(A) receptor subunit alpha-1 GABA-A receptor GBRA1_HUMAN TBPS | agonist GABA site
Type:
Protein
Mol. Mass.:
51817.35
Organism:
Homo sapiens (Human)
Description:
P14867
Residue:
456
  
Component 2
Name:
Gamma-aminobutyric acid receptor subunit beta-2
Synonyms:
GABA(A) receptor subunit beta-2 GBRB2_HUMAN
Type:
PROTEIN
Mol. Mass.:
59167.91
Organism:
Homo sapiens (Human)
Description:
EBI_221
Residue:
512
  
Component 3
Name:
Gamma-aminobutyric acid receptor subunit gamma-2
Synonyms:
GABA(A) receptor subunit gamma-2 GBRG2_HUMAN
Type:
PROTEIN
Mol. Mass.:
54172.74
Organism:
Homo sapiens (Human)
Description:
EBI_217
Residue:
467
  
Inhibitor
Name:
BDBM50185292
Synonyms:
6-Benzyl-4-oxo-1,4-dihydroquinoline-3-carboxylic Acid EthylEster CHEMBL381059 | ethyl 6-benzyl-4-oxo-1,4-dihydroquinoline-3-carboxylate
Type:
Small organic molecule
Emp. Form.:
C19H17NO3
Mol. Mass.:
307.3432
SMILES:
CCOC(=O)c1cnc2ccc(Cc3ccccc3)cc2c1O
: